{"text_format":"1","workbook":"xlsx","n_sheets":19,"sheets":["Introduction","Table of Contents","Operations in Inventory","Stationary Combustion","Mobile & Transportation","Waste Mngmt.","Direct - Make-up Carbonates","CHP Allocation","Indirect - Energy Imports","Energy Exports","CO2 Imports and Exports","Summary Table","Custom Emission Factors","Energy content","Conversion Factors","Energy Factors","Raw Data Log","Supporting Info. on Biomass","Revision Log"],"not_rendered":{"charts":0,"images":13,"macros":1,"external_links":1,"defined_names":47,"comments":1,"pivot_tables":0},"unopened":[],"bounds":{"document_bytes":16777216,"sheet_cells":100000,"rows_first":2000,"rows_last":500,"rows_between":2000,"halvings":0,"cell_chars":16384,"cell_head_chars":4096},"cells_cut":0,"cells_raw":0,"read":"whole","date_system":"1900"}

{"sheet":"Introduction","index":0,"n_rows":33,"n_cols":4,"rows_kept":33,"cut":false,"hidden":false,"merged":[[0,1,0,9],[10,2,10,9],[26,2,26,8],[3,2,8,9],[12,2,13,7],[11,2,11,7],[1,2,1,8],[28,2,28,8],[30,3,30,8],[31,3,31,8],[32,3,32,8]]}
["        ","ICFPA/NCASI Spreadsheets for \nCalculating GHG emissions from pulp and paper manufacturing\n\nWorkbook Version 2.1a, for the USDOE 1605(b) \nVoluntary Reporting of Greenhouse Gases Program\n\n (see below for USER AGREEMENT)"]
[null,null,"An aid to developing estimates using the methods in \"Calculation tools for estimating greenhouse gas emissions from pulp and paper mills,\" Report Version 1.0"]
[]
[null,null,"This tool intends to facilitate the calculation of direct CO2, CH4, and N2O emissions from pulp and paper mills and ancillary operations.  It also addresses emissions attributable to the purchase and export of electricity and/or steam. This document is to be used in conjunction with three additional documents:\n1) 'Calculation tools for estimating Greenhouse Gas Emissions from pulp and paper mills,' and\n2) ‘Corporate GHG Accounting and Reporting: Corporate Inventory Module’, available at www.ghgprotocol.org \n3) 'Instructions for Form EIA-1605 Voluntary Reporting of Greenhouse Gases, For Data Through 2002,' available from the USDOE at http://www.eia.doe.gov/oiaf/1605/techassist.html\n\n"]
[]
[]
[]
[]
[]
[]
{"$rows_left_out":24}
{"sheet":"Table of Contents","index":1,"n_rows":21,"n_cols":4,"rows_kept":21,"cut":false,"hidden":false,"merged":[[6,3,6,7],[11,3,11,7],[12,3,12,7],[10,3,10,7],[15,3,15,6],[25,3,25,8],[16,3,16,5],[22,3,22,8],[23,3,23,8],[24,3,24,8]]}
[]
[null,null,"Name of worksheet","Content / purpose"]
[]
[null,null,"Introduction"]
[null,null,"Table of Contents"]
[null,null,"Operations in Inventory","Describing the inventory boundaries and listing the operations included in the inventory"]
[null,null,"Stationary Combustion","Direct emissions of CO2, CH4, and N2O resulting from fuel combustion - includes default emission factors"]
[null,null,"Mobile & Transportation","Emissions of CO2, CH4, and N2O from fuel combustion in mobile equipment and transportation devices"]
[null,null,"Waste Mngmt.","Emissions of CH4 resulting from mill-owned landfills or anaerobic treatment operations"]
[null,null,"Direct - Make-up Carbonates","Direct emissions of CO2 from make-up carbonates used in the pulp mill"]
{"$rows_left_out":12}
{"sheet":"Operations in Inventory","index":2,"n_rows":56,"n_cols":7,"rows_kept":56,"cut":false,"hidden":false,"merged":[[17,5,17,6],[1,1,1,7],[4,1,4,5],[14,5,14,6],[15,5,15,6],[7,5,7,6],[8,5,8,6],[9,5,9,6],[11,5,11,6],[12,5,12,6]]}
[]
[null,"This worksheet is for showing which operations are included in the inventory"]
[null,null,null,null,null,"User enters information in spaces with this color  "]
[]
[null,"Operations in the Inventory"]
[]
[null,null,null,null,null,"Identifying name assigned to this inventory:"]
[]
[null,null,null,null,null,"Use this space to provide a general description of operational boundaries."]
[]
{"$rows_left_out":47}
{"sheet":"Stationary Combustion","index":3,"n_rows":105,"n_cols":12,"rows_kept":105,"cut":false,"hidden":false,"merged":[[104,3,104,6],[5,2,5,8],[14,5,14,7],[56,3,56,6],[54,3,54,6],[14,8,14,11],[102,2,102,6],[101,2,101,6],[10,1,10,2],[3,2,3,6],[8,1,8,2],[9,1,9,2],[103,3,103,6],[49,4,49,7],[48,4,48,7],[47,4,47,7]]}
[]
[]
[null,null,"Direct Emissions - Stationary Fuel Combustion, (including methane and nitrous oxide emissions from biomass fuels)"]
[null,null,"Note: Where mills are exporting CO2 to precipitated calcium carbonate (PCC) plants, these exports are not considered emissions.  Amounts of exported CO2 are calculated in the sheet for \"CO2 Imports and Exports.\"  On the \"Stationary Combustion\" sheet (this sheet), the amounts of exported CO2 are automatically subtracted from the sum of direct emissions from stationary fossil fuel combustion.  \n\nAlso, emissions from mobile sources are reported on the \"Mobile & Transportation\" spreadsheet immediately behind this spreadsheet"]
[]
[null,null,"These spreadsheets include significant amounts of material copied from other WRI and WBCSD calculation tools. \n Intellectual property rights of the WRI and WBCSD calculation tools belong to WRI and WBCSD, unless stated otherwise."]
[]
[null,"EXPLANATION OF CELL COLOR SCHEME"]
[null,"User entry: Source / fuel description"]
[null,"User entry: Fuel use / emission factor values",null,null,"Suggested default emission factors shown below"]
{"$rows_left_out":96}
{"sheet":"Mobile & Transportation","index":4,"n_rows":97,"n_cols":28,"rows_kept":97,"cut":false,"hidden":false,"merged":[[55,6,55,8],[55,9,55,11],[44,10,44,12],[86,9,86,11],[66,18,66,19],[67,18,67,19],[86,12,86,14],[68,18,68,19],[70,18,70,19],[69,18,69,19],[94,9,94,11],[60,18,60,21],[77,18,77,23],[16,21,16,24],[55,12,55,14],[44,13,44,15],[62,18,62,19],[72,18,72,19],[73,18,73,19],[71,18,71,19],[18,21,18,26],[63,18,63,19],[64,18,64,19],[65,18,65,19],[3,2,3,10],[8,1,8,2],[5,2,5,11],[9,1,9,2],[10,1,10,2],[55,4,55,5]]}
[null,null,"Direct or Indirect Emissions - Mobile and Transportation Sources"]
[null,null,"Note: Emissions from stationary sources are reported on the \"Direct-Fuel Combust.\" spreadsheet immediately in front of this spreadsheet"]
[]
[null,null,"These spreadsheets include significant amounts of material copied from other WRI and WBCSD calculation tools. \n Intellectual property rights of the WRI and WBCSD calculation tools belong to WRI and WBCSD, unless stated otherwise."]
[]
[null,null,"This worksheet can be used to calculate emissions from mobile combustion sources, including transportation.\nThe worksheet contains two parts:\n    Part 1 is used to calculate transportation emissions based on quantity of fuels consumed.\n    Part 2 is used to calculate emissions from non-transportation mobile sources such as harvesting equipment\n\nFor transportation emissions, if total fuel consumption is not known, but distance traveled and vehicle efficiency are known, the \"Optional Calculator\" (to the right of the Part 1 table) can be used to estimate fuel consumption based on distance and efficiency information.\n\nBe careful to avoid double counting!  If emissions for a source are estimated using Part 1, do not also estimate emissions for this same source using Part 2.\n\nDo not include any combustion sources on this page that were already addressed in the \"Direct - Fuel Combust.\" sheet."]
[]
[null,"EXPLANATION OF CELL COLOR SCHEME"]
[null,"User entry: Source / fuel description"]
[null,"User entry: Fuel use / emission factor values",null," "]
{"$rows_left_out":88}
{"sheet":"Waste Mngmt.","index":5,"n_rows":158,"n_cols":57,"rows_kept":158,"cut":false,"hidden":false,"merged":[[9,1,9,2],[10,1,10,2],[32,4,32,10],[138,5,138,9],[126,4,126,11],[116,9,116,12],[16,4,16,12],[4,1,4,9],[14,2,14,6],[13,2,13,6],[49,2,49,11],[44,10,44,13],[8,1,8,2],[28,7,28,10],[46,10,46,13],[32,11,32,14],[30,2,30,11],[153,4,153,8],[157,4,157,8],[139,2,139,5],[55,2,55,3],[123,2,123,5],[56,2,56,3]]}
[null,null,"Direct or Indirect Emissions - Waste Management"]
[null,null,"For landfills and anaerobic wastewater treatment and sludge digestion systems"]
[null,null,"Note: Scroll down the page to find the spreadsheet for anaerobic treatment systems"]
[]
[null,"These spreadsheets include significant amounts of material copied from other WRI and WBCSD calculation tools. \n Intellectual property rights of the WRI and WBCSD calculation tools belong to WRI and WBCSD, unless stated otherwise."]
[]
[]
[null,"EXPLANATION OF CELL COLOR SCHEME"]
[null,"User entry: Source description"]
[null,"User entry: Data and parameter values"]
{"$rows_left_out":149}
{"sheet":"Direct - Make-up Carbonates","index":6,"n_rows":13,"n_cols":6,"rows_kept":13,"cut":false,"hidden":false,"merged":[[18,1,18,12],[3,2,3,6],[5,2,5,6],[1,1,1,12],[12,1,12,6]]}
[]
[null,"These spreadsheets include significant amounts of material copied from other WRI and WBCSD calculation tools. \n Intellectual property rights of the WRI and WBCSD calculation tools belong to WRI and WBCSD, unless stated otherwise."]
[]
[null,null,"Direct Emissions - Emissions from Make-up \ncarbonates used in the pulp mill*"]
[]
[null,null,"Direct Emissions - Emissions from Make-up \ncarbonates used in the pulp mill"]
[]
[null,null,"Chemical","Amount used in the pulp mill [short tons/year]","Emission factor [kg CO2 per kg chemical]","CO2 Emissions [metric tonnes CO2 per year]"]
[null,null,"Sodium Carbonate",null,0.41499999999999998,{"$f":"D9*E9*0.9072","v":0}]
[null,null,"Calcium Carbonate*",null,0.44,{"$f":"D10*E10*0.9072","v":0}]
{"$rows_left_out":4}
{"sheet":"CHP Allocation","index":7,"n_rows":34,"n_cols":19,"rows_kept":34,"cut":false,"hidden":false,"merged":[[1,1,1,14],[10,3,10,4],[11,3,11,4],[33,1,33,9],[20,10,20,11],[3,3,3,11],[9,3,9,4],[14,2,14,8],[16,5,16,13]]}
[]
[null,"These spreadsheets include significant amounts of material copied from other WRI and WBCSD calculation tools. \n Intellectual property rights of the WRI and WBCSD calculation tools belong to WRI and WBCSD, unless stated otherwise."]
[]
[null,null,null,"Combined heat and power:  \nAllocating emissions based on the efficiency of heat and power production"]
[]
[null,null,null,"Note:  If a facility is using all of the energy outputs of a CHP system, there is no need to allocate the emissions."]
[]
[null,null,"EXPLANATION OF CELL COLOR SCHEME"]
[null,null,null,null,"User entry: Source / fuel description"]
[null,null,null,"User entry: Fuel use / emission factor values"]
{"$rows_left_out":25}
{"sheet":"Indirect - Energy Imports","index":8,"n_rows":120,"n_cols":11,"rows_kept":120,"cut":false,"hidden":false,"merged":[[39,2,39,5],[30,2,30,6],[32,2,32,10],[0,1,0,12],[6,3,6,4],[7,3,7,4],[5,3,5,4],[12,4,12,6],[12,7,12,9]]}
[null,"These spreadsheets include significant amounts of material copied from other WRI and WBCSD calculation tools. \n Intellectual property rights of the WRI and WBCSD calculation tools belong to WRI and WBCSD, unless stated otherwise."]
[null,null,"Indirect Emissions"]
[null,null,"Electricity and/or steam imports"]
[]
[null,"EXPLANATION OF CELL COLOR SCHEME"]
[null,null,null,"User entry: Source description"]
[null,null,null,"User entry: Fuel use / emission factor values"]
[null,null,null,"Auto calculated value:"]
[]
[]
{"$rows_left_out":111}
{"sheet":"Energy Exports","index":9,"n_rows":35,"n_cols":14,"rows_kept":35,"cut":false,"hidden":false,"merged":[[34,3,34,7],[17,8,17,10],[0,1,0,12],[7,3,7,4],[8,3,8,4],[9,3,9,4],[17,4,17,6],[12,2,12,7]]}
[null,"These spreadsheets include significant amounts of material copied from other WRI and WBCSD calculation tools. \n Intellectual property rights of the WRI and WBCSD calculation tools belong to WRI and WBCSD, unless stated otherwise."]
[null,null,"Emissions Associated with Exports of Electricity and Steam"]
[]
[null,null,"Note: The emissions related to electricity and steam exports "]
[null,null,"should be reported separately from indirect emissions from imported power or steam"]
[]
[null,"EXPLANATION OF CELL COLOR SCHEME"]
[null,null,null,"User entry: Source description"]
[null,null,null,"User entry: Fuel use / emission factor values"]
[null,null,null,"Auto calculated value:"]
{"$rows_left_out":26}
{"sheet":"CO2 Imports and Exports","index":10,"n_rows":20,"n_cols":7,"rows_kept":20,"cut":false,"hidden":false,"merged":[[1,1,1,7],[0,1,0,12],[14,2,14,4]]}
[null,"These spreadsheets include significant amounts of material copied from other WRI and WBCSD calculation tools. \n Intellectual property rights of the WRI and WBCSD calculation tools belong to WRI and WBCSD, unless stated otherwise."]
[null,"Imports and Exports of Fossil CO2 , including exports to satellite precipitated calcium carbonate (PCC) plants"]
[]
[null,null,"Fossil CO2 imported to mill site (e.g. for neutralization)"]
[]
[null,null,"Total fossil CO2 imported to mill\n[metric tonnes CO2 per year]"]
[null,"Example",19375]
[]
[]
[]
{"$rows_left_out":11}
{"sheet":"Summary Table","index":11,"n_rows":34,"n_cols":9,"rows_kept":34,"cut":false,"hidden":false,"merged":[[15,2,15,3],[17,2,17,3],[0,2,0,14],[4,2,4,3],[6,2,6,3],[9,2,9,3],[33,2,33,8],[30,2,30,3],[4,5,4,8],[6,5,6,8],[32,2,32,8],[20,2,20,3],[22,2,22,3],[24,2,24,3],[28,2,28,3],[13,2,13,3]]}
[null,null,"These spreadsheets include significant amounts of material copied from other WRI and WBCSD calculation tools. \n Intellectual property rights of the WRI and WBCSD calculation tools belong to WRI and WBCSD, unless stated otherwise."]
[null,null,"Summary of Inventory Results"]
[]
[]
[null,null,"Name of Inventory",null,null,{"$f":"IF('Operations in Inventory'!F8=\"\",\"\",'Operations in Inventory'!F8)","v":""}]
[]
[null,null,"General description of inventory boundaries",null,null,{"$f":"IF('Operations in Inventory'!F10=\"\",\"\",'Operations in Inventory'!F10)","v":""}]
[]
[null,null,"Direct Emissions",null,null,"CO2\n(metric tonnes)","CH4\n(metric tonnes)","N2O\n(metric tonnes)","CO2-equiv\n(metric tonnes)"]
[null,null,"Direct emissions from stationary combustion",null,null,{"$f":"'Stationary Combustion'!I50","v":0},{"$f":"'Stationary Combustion'!J50","v":0},{"$f":"'Stationary Combustion'!K50","v":0},{"$f":"'Stationary Combustion'!L50","v":0}]
{"$rows_left_out":25}
{"sheet":"Custom Emission Factors","index":12,"n_rows":25,"n_cols":6,"rows_kept":25,"cut":false,"hidden":false,"merged":[[9,3,9,4],[7,3,7,4],[8,3,8,4]]}
["The intellectual property rights of this calculation tool belong to WRI and WBCSD, unless stated otherwise in any of the tools."]
["Please cite the orginial reference when using this tool."]
[]
[null,null,"Custom Emission Factors"]
[null,null,"Calculating custom emission factors"]
[]
[null,"EXPLANATION OF CELL COLOR SCHEME"]
[null,null,null,"User entry: Source description"]
[null,null,null,"User entry: Fuel use / emission factor values"]
[null,null,null,"Auto calculated value:"]
{"$rows_left_out":16}
{"sheet":"Energy content","index":13,"n_rows":37,"n_cols":6,"rows_kept":37,"cut":false,"hidden":false,"merged":[[2,0,2,5],[35,1,35,5],[34,1,34,5]]}
[]
["Energy content (HHV)"]
["Default factors for fuel specific higher heating values"]
["Copied from the WRI/WBCSD Calculation tools (unless specifically noted otherwise for specific entries)"]
[]
[]
[]
[null,"Fuel type","Higher heating value‡","Heating Value Units","Carbon, % by weight*","Typical density*"]
[null,null,"(HHV)",null,null,"( lb / gal )"]
[]
{"$rows_left_out":28}
{"sheet":"Conversion Factors","index":14,"n_rows":41,"n_cols":6,"rows_kept":41,"cut":false,"hidden":false,"merged":[]}
["The intellectual property rights of this calculation tool belong to WRI and WBCSD, unless stated otherwise in any of the tools."]
["Please cite the orginial reference when using this tool."]
[]
["Conversion Factors"]
[]
[]
[]
[null,null,"Mass"]
[null,null,"1 pound (lb)","453.6 grams (g)","0.4536 kilograms (kg)","0.0004536 metric tons (tonne)"]
[null,null,"1 kilogram (kg)","2.205 pounds (lb)"]
{"$rows_left_out":32}
{"sheet":"Energy Factors","index":15,"n_rows":220,"n_cols":256,"rows_kept":220,"cut":false,"hidden":false,"merged":[]}
["This table presents a matrix of factors for converting fuel consumption input data into units of MMBtu (HHV)",null,null,null,null,null,null,null,null,null,null,null,null,null,null,null,null,null,null,null,null,null,null,null,null,null,null,null,null,null,null,null,null,null,null,null,null,null,null,null,null,null,null,null,null,null,null,null,null,null,null,null,null,null,null,null,null,null,null,null,null,null,null,null,null,null,null,null,null,null,null,null,null,null,null,null,null,null,null,null,null,null,null,null,null,null,null,null,null,null,null,null,null,null,null,null,null,null,null,null,null,null,null,null,null,null,null,null,null,null,null,null,null,null,null,null,null,null,null,null,null,null,null,null,null,null,null,null,null,null,null,null,null,null,null,null,null,null,null,null,null,null,null,null,null,null,null,null,null,null,null,null,null,null,null,null,null,null,null,null,null,null,null,null,null,null,null,null,null,null,null,null,null,null,null,null,null,null,null,null,null,null,null,null,null,null,null,null,null,null,null,null,null,null,null,null,null,null,null,null,null,null,null,null,null,null,null,null,null,null,null,null,null,null,null,null,null,null,null,null,null,null,null,null,null,null,null,null,null,null,null,null,null,null,null,null,null,null,null,null,null,null,null,null,null,null,null,null,null,null,null,null,null,null,null,"Disable Error Notification Save Box"]
["(Fuel consumption data in units listed can be converted to units of MMBtu HHV by multiplying by the factor)",null,null,null,null,null,null,null,null,null,null,null,null,null,null,null,null,null,null,null,null,null,null,null,null,null,null,null,null,null,null,null,null,null,null,null,null,null,null,null,null,null,null,null,null,null,null,null,null,null,null,null,null,null,null,null,null,null,null,null,null,null,null,null,null,null,null,null,null,null,null,null,null,null,null,null,null,null,null,null,null,null,null,null,null,null,null,null,null,null,null,null,null,null,null,null,null,null,null,null,null,null,null,null,null,null,null,null,null,null,null,null,null,null,null,null,null,null,null,null,null,null,null,null,null,null,null,null,null,null,null,null,null,null,null,null,null,null,null,null,null,null,null,null,null,null,null,null,null,null,null,null,null,null,null,null,null,null,null,null,null,null,null,null,null,null,null,null,null,null,null,null,null,null,null,null,null,null,null,null,null,null,null,null,null,null,null,null,null,null,null,null,null,null,null,null,null,null,null,null,null,null,null,null,null,null,null,null,null,null,null,null,null,null,null,null,null,null,null,null,null,null,null,null,null,null,null,null,null,null,null,null,null,null,null,null,null,null,null,null,null,null,null,null,null,null,null,null,null,null,null,null,null,null,1]
[]
["Consumption Input Units (right)","Btu (HHV)","Btu (LHV)","Million Btu (HHV)","Million Btu (LHV)","GJ (HHV)","US gallon","Liter","bbl","std ft3","std m3","lb","US ton","Metric Tonne","GJ (LHV)","MWh"]
["Fuel type (below)"]
["Gasoline",9.9999999999999995E-7,1.0529999999999999E-6,1,1.0529999999999999,0.94789999999999996,0.1202,{"$f":"IF(G6=\"N/A\",\"N/A\",G6/3.785)","v":3.1756935270805808E-2},{"$f":"IF(G6=\"N/A\",\"N/A\",G6*42)","v":5.0484},"N/A","N/A",{"$f":"IF(G6=\"N/A\",\"N/A\",G6/6.17)","v":1.9481361426256078E-2},{"$f":"L6*2000","v":38.962722852512158},{"$f":"L6*2205","v":42.956401944894651},0.99780000000000002,3.4119999999999999]
["Gasoline / petrol",9.9999999999999995E-7,1.0529999999999999E-6,1,1.0529999999999999,0.94789999999999996,0.1202,{"$f":"IF(G7=\"N/A\",\"N/A\",G7/3.785)","v":3.1756935270805808E-2},5.0484,"N/A","N/A",{"$f":"IF(G7=\"N/A\",\"N/A\",G7/6.17)","v":1.9481361426256078E-2},{"$f":"L7*2000","v":38.962722852512158},42.956401944894651,0.99780000000000002,3.4119999999999999]
["Gasoline / petrol Mobile 4-stroke engines",9.9999999999999995E-7,1.0529999999999999E-6,1,1.0529999999999999,0.94789999999999996,0.1202,{"$f":"IF(G8=\"N/A\",\"N/A\",G8/3.785)","v":3.1756935270805808E-2},5.0484,"N/A","N/A",{"$f":"IF(G8=\"N/A\",\"N/A\",G8/6.17)","v":1.9481361426256078E-2},{"$f":"L8*2000","v":38.962722852512158},42.956401944894651,0.99780000000000002,3.4119999999999999]
["Gasoline / petrol Mobile 2-stroke engines, general",9.9999999999999995E-7,1.0529999999999999E-6,1,1.0529999999999999,0.94789999999999996,0.1202,{"$f":"IF(G9=\"N/A\",\"N/A\",G9/3.785)","v":3.1756935270805808E-2},5.0484,"N/A","N/A",{"$f":"IF(G9=\"N/A\",\"N/A\",G9/6.17)","v":1.9481361426256078E-2},{"$f":"L9*2000","v":38.962722852512158},42.956401944894651,0.99780000000000002,3.4119999999999999]
["Gasoline / petrol Mobile 2-stroke engines, forestry",9.9999999999999995E-7,1.0529999999999999E-6,1,1.0529999999999999,0.94789999999999996,0.1202,{"$f":"IF(G10=\"N/A\",\"N/A\",G10/3.785)","v":3.1756935270805808E-2},5.0484,"N/A","N/A",{"$f":"IF(G10=\"N/A\",\"N/A\",G10/6.17)","v":1.9481361426256078E-2},{"$f":"L10*2000","v":38.962722852512158},42.956401944894651,0.99780000000000002,3.4119999999999999]
{"$rows_left_out":211}
{"sheet":"Raw Data Log","index":16,"n_rows":210,"n_cols":14,"rows_kept":210,"cut":false,"hidden":false,"merged":[]}
["Stationary Sources",null,null,null,"CO2",null,"CH4",null,"N20"]
["Source Description","Fuel Type","Quantity Burned","Units","Emission Factor","Units","Emission Factor","Units","Emission Factor","Units"]
[]
[]
[]
[]
[]
[]
[]
[]
{"$rows_left_out":201}
{"sheet":"Supporting Info. on Biomass","index":17,"n_rows":103,"n_cols":11,"rows_kept":103,"cut":false,"hidden":false,"merged":[[9,1,9,6],[58,6,58,7],[0,1,0,12],[4,1,4,6],[6,1,6,6],[8,1,8,6],[15,1,15,2],[13,1,13,2],[14,1,14,2],[43,1,43,7],[102,2,102,9],[20,6,20,7],[81,2,81,8],[42,4,42,7],[45,3,45,10],[80,3,80,8],[56,2,56,6]]}
[]
[]
[null,null,"Supporting Information on Biomass"]
[null,null,"Estimating Climate-Neutral CO2 Emissions from Biomass Combustion."]
[null,"Many pulp and paper mills generate more than half of their energy needs from climate-neutral biomass fuels recovered from the industry’s waste and process streams.  Energy-rich biomass – derived from wood chips, bark, sawdust and pulping liquors recovered from the harvesting and manufacturing processes – is the result of atmospheric carbon dioxide being sequestered by trees during growth and transformed into organic carbon substances.  When these biomass fuels are burned, the CO2 emitted during the manufacturing and combustion processes is the atmospheric carbon dioxide that was sequestered during growth of the tree; hence, there is no net contribution to the atmospheric CO2 level.  This carbon cycle is a closed-loop.  New tree growth keeps absorbing atmospheric carbon dioxide and maintains the cycle."]
[]
[null,"Any increases or decreases in the amount of carbon sequestered by the forests are accounted for in the comprehensive forest accounting system.  This is the approach generally prescribed for national inventories by the United Nations Framework Convention on Climate Change.  Most international protocols including that of the Intergovernmental Panel on Climate Change (IPCC) have adopted the convention set out by the United Nations. The IPCC has stated that emissions from biomass do not add to atmospheric concentrations of carbon dioxide.  (See footnote 1) \n\nThe USDOE also accepts this convention, and recommends assigning an emission factor of 0 lb CO2/MMBtu for biomass based fuels (this zero CO2 emission factor is used in the \"Stationary Combustion\" sheet for biomass fuels)."]
[]
[null,"Estimated Biomass Emissions:\nThe information reported below on biomass emissions is being supplied:\n\n To ensure that readers understand the entity’s overall energy profile in terms of both greenhouse gas emissions, and non-greenhouse gas emissions, and\n To provide awareness and understanding of how climate-neutral biomass fuels are generated and used in the manufacture of pulp and paper.\n\nAlso, note that the information reported below is in conformance with the general greenhouse gas protocol designed by the World Resources Institute and the World Business Council for Sustainable Development.  Users of these calculation tools may elect to modify the format and type of information presented based on specific facility or company needs.\n"]
[null,"Footnote 1.\n\nIntergovernmental Panel on Climate Change (IPCC). Revised 1996 IPCC Guidelines for National Greenhouse Gas Inventories: Reporting Instructions (Volume 1). IPCC National Greenhouse Gas Inventory Program.  http://www.ipcc-nggip.iges.or.jp/public/gl/invs4.htm  (26 Nov. 2001)\n\nIntergovernmental Panel on Climate Change (IPCC). Revised 1996 IPCC Guidelines for National Greenhouse Gas Inventories: Reference Manual (Volume 3). IPCC National Greenhouse Gas Inventory Program.  http://www.ipcc-nggip.iges.or.jp/public/gl/invs6.htm  (20 Nov. 2001)\n\n"]
{"$rows_left_out":94}
{"sheet":"Revision Log","index":18,"n_rows":9,"n_cols":1,"rows_kept":9,"cut":false,"hidden":false,"merged":[[4,0,4,11],[8,0,8,11]]}
["Revision Log"]
[]
["Revisions from Version 2.1 to Version 2.1a"]
[]
["Corrected an error in the visual basic forms that write data to the Energy Exports worksheet.  The visual basic code attempted to write entries of the optional element 'emissions intensity of the grid into which power is exported' to the wrong cell.  Data should have been written to column N, but rather was attempted to be written to column L which is electronically \"protected\" from revision.  This did not result in a calculation error (i.e., calculation results were not affected).  However, it did result in a \"run time\" error of the visual basic code, crashing the visual basic program.  The visual basic code was revised, and the formulas previously overwritten were replaced."]
[]
["Revisions from Version 2.1a to Version 2.1b"]
[]
["Waste quantities now need to be entered as wet mass rather than dry mass. Default Lo is on a wet mass basis."]