{"text_format":"1","workbook":"xlsx","n_sheets":17,"sheets":["Introduction","Table of Contents","Operations in Inventory","Direct - Fuel Combust.","Mobile & Transportation","Waste Management","Biomass Combustion CO2","Indirect - Energy Imports","Indirect - Energy Exports","CHP Allocation","Summary Table","Custom Emission Factors","Energy content","Conversion Factors","Raw Data Log","Energy Factors","Revisions"],"not_rendered":{"charts":0,"images":11,"macros":1,"external_links":1,"defined_names":47,"comments":1,"pivot_tables":0},"unopened":[],"bounds":{"document_bytes":16777216,"sheet_cells":100000,"rows_first":2000,"rows_last":500,"rows_between":2000,"halvings":0,"cell_chars":16384,"cell_head_chars":4096},"cells_cut":0,"cells_raw":0,"read":"whole","date_system":"1900"}

{"sheet":"Introduction","index":0,"n_rows":33,"n_cols":7,"rows_kept":33,"cut":false,"hidden":false,"merged":[[28,2,28,8],[30,3,30,8],[31,3,31,8],[32,3,32,8],[0,1,0,9],[10,2,10,9],[26,2,26,8],[3,2,8,9],[12,2,13,7],[11,2,11,7],[1,2,1,8]]}
["        ","ICFPA/NCASI Spreadsheets for \nCalculating GHG emissions from Wood Products Manufacturing\n\nWorkbook Version 3.3b, appropriate for use in the Canadian Mandatory Reporting Program\n(Large Final Emitters program) or for potential regulatory offset project estimation. IPCC Method for methane emissions\n\n (see below for USER AGREEMENT)"]
[null,null,"An aid to developing estimates using the methods in \"Calculation Tools for Estimating Greenhouse Gas Emissions from Wood Products Manufacturing Facilities\", Report Version 1.0"]
[]
[null,null,"This tool intends to facilitate the calculation of direct CO2, CH4, and N2O emissions from wood products manufacturing and ancillary operations.  It also addresses emissions attributable to the purchase and export of electricity and/or steam. This document is to be used in conjunction with two additional documents:\n1) 'Calculation Tools for Estimating Greenhouse Gas Emissions from Wood Products Manufacturing Facilities, Report Version 1.0' and\n2) ‘The Greenhouse Gas Protocol, A Corporate Accounting and Reporting Standard, Revised Edition’, available at www.ghgprotocol.org \n"]
[]
[]
[]
[]
[]
[]
{"$rows_left_out":24}
{"sheet":"Table of Contents","index":1,"n_rows":19,"n_cols":4,"rows_kept":19,"cut":false,"hidden":false,"merged":[[23,3,23,8],[15,3,15,5],[20,3,20,8],[21,3,21,8],[22,3,22,8],[6,3,6,7],[10,3,10,7],[11,3,11,7],[12,3,12,7],[14,3,14,6]]}
[]
[null,null,"Name of worksheet","Content / purpose"]
[]
[null,null,"Introduction"]
[null,null,"Table of Contents"]
[null,null,"Operations in Inventory","Describing the inventory boundaries and listing the operations included in the inventory"]
[null,null,"Stationary Combustion","Direct emissions of CO2, CH4, and N2O resulting from fuel combustion - includes default emission factors"]
[null,null,"Mobile & Transportation","Emissions of CO2, CH4, and N2O from fuel combustion in mobile equipment and transportation devices"]
[null,null,"Waste Management","Emissions of CH4 resulting from mill-owned landfills or anaerobic treatment operations"]
[null,null,"Biomass Combustion CO2","Direct emissions of biomass CO2 for informational purposes only (not included with fossil fuel CO2 emissions)"]
{"$rows_left_out":10}
{"sheet":"Operations in Inventory","index":2,"n_rows":40,"n_cols":7,"rows_kept":40,"cut":false,"hidden":false,"merged":[[17,5,17,6],[1,1,1,7],[4,1,4,5],[14,5,14,6],[15,5,15,6],[7,5,7,6],[8,5,8,6],[9,5,9,6],[11,5,11,6],[12,5,12,6]]}
[]
[null,"This worksheet is for showing which operations are included in the inventory"]
[null,null,null,null,null,"User enters information in spaces with this colour  "]
[]
[null,"Operations in the Inventory"]
[]
[null,null,null,null,null,"Identifying name assigned to this inventory:"]
[]
[null,null,null,null,null,"Use this space to provide a general description of operational boundaries."]
[]
{"$rows_left_out":31}
{"sheet":"Direct - Fuel Combust.","index":3,"n_rows":104,"n_cols":13,"rows_kept":104,"cut":false,"hidden":false,"merged":[[14,9,14,12],[10,1,10,2],[3,2,3,6],[9,1,9,2],[8,1,8,2],[5,2,5,8],[14,4,14,5],[14,6,14,8],[99,2,99,6],[100,2,100,6],[102,3,102,6],[103,3,103,6],[2,2,2,6],[50,3,50,6],[52,3,52,6],[17,6,17,8],[46,2,46,8]]}
[]
[]
[null,null,"Direct Emissions - Stationary Fuel Combustion\n(including methane and nitrous oxide emissions from biomass fuels)"]
[null,null,"\nNote: Emissions from mobile sources are reported on the \"Mobile & Transportation\" spreadsheet immediately behind this spreadsheet"]
[]
[null,null,"These spreadsheets include significant amounts of material copied from other WRI and WBCSD calculation tools. \n Intellectual property rights of the WRI and WBCSD calculation tools belong to WRI and WBCSD, unless stated otherwise."]
[]
[null,"EXPLANATION OF CELL COLOUR SCHEME"]
[null,"User entry: Source / fuel description"]
[null,"User entry: Fuel use / emission factor values",null,null,"Suggested default emission factors shown below"]
{"$rows_left_out":95}
{"sheet":"Mobile & Transportation","index":4,"n_rows":80,"n_cols":17,"rows_kept":80,"cut":false,"hidden":false,"merged":[[45,7,45,9],[51,3,51,6],[18,18,19,24],[41,18,42,26],[16,18,16,21],[3,2,3,10],[4,2,4,11],[15,7,15,9]]}
[null,null,"Mobile and Transportation Sources which are Integral to the Production Process"]
[null,null,"Note: Emissions from stationary sources are reported on the \"Stationary Combustion\" worksheet"]
[]
[null,null,"These spreadsheets include significant amounts of material copied from other WRI and WBCSD calculation tools. \n Intellectual property rights of the WRI and WBCSD calculation tools belong to WRI and WBCSD, unless stated otherwise."]
[null,null,"This worksheet can be used to calculate emissions from mobile combustion sources, including transportation.\n\nFor transportation emissions, if total fuel consumption is not known, but distance traveled and vehicle efficiency are known, the \"Optional Calculator\" (to the right of the table) can be used to estimate fuel consumption based on distance and efficiency information.\n\nDo not include any combustion sources on this page that were already addressed in the \"Stationary Combustion\" sheet."]
[]
[null,null,"EXPLANATION OF CELL COLOUR SCHEME"]
[null,null,null,"User entry: Source / fuel description"]
[null,null,null,"User entry: Fuel use / emission factor values"," "]
[null,null,null,"Auto calculated value:"]
{"$rows_left_out":71}
{"sheet":"Waste Management","index":5,"n_rows":159,"n_cols":57,"rows_kept":159,"cut":false,"hidden":false,"merged":[[142,4,142,8],[4,1,4,9],[13,2,13,5],[14,2,14,5],[46,9,46,12],[32,4,32,9],[30,2,30,10],[158,3,158,7],[49,2,49,11],[44,9,44,12],[8,1,8,2],[9,1,9,2],[10,1,10,2],[28,6,28,9],[16,4,16,10],[32,10,32,13],[56,3,56,5],[116,9,116,12],[154,3,154,7],[127,4,127,9],[140,2,140,5],[124,2,124,5],[139,4,139,8]]}
[null,null,"Waste Management"]
[null,null,"For landfills and anaerobic wastewater treatment and sludge digestion systems"]
[null,null,"Note: Scroll down the page to find the spreadsheet for anaerobic treatment systems"]
[]
[null,"These spreadsheets include significant amounts of material copied from other WRI and WBCSD calculation tools. \n Intellectual property rights of the WRI and WBCSD calculation tools belong to WRI and WBCSD, unless stated otherwise."]
[]
[]
[null,"EXPLANATION OF CELL COLOUR SCHEME"]
[null,"User entry: Source description"]
[null,"User entry: Data and parameter values"]
{"$rows_left_out":150}
{"sheet":"Biomass Combustion CO2","index":6,"n_rows":44,"n_cols":10,"rows_kept":44,"cut":false,"hidden":false,"merged":[[43,3,43,8],[0,1,0,12],[4,1,4,6],[6,1,6,6],[8,1,8,6],[14,1,14,2],[12,1,12,2],[13,1,13,2],[19,4,19,5],[41,4,41,7]]}
[]
[]
[null,null,"Additional Information on Biomass"]
[null,null,"Estimating CO2 Emissions from Biomass Combustion."]
[null,"Many wood products manufacturing facilities generate more than half of their energy needs from biomass fuels recovered from the industry’s waste and process streams.  The CO2 generated when biomass fuels are burned is not included in GHG emission totals.  The GHG Protocol, however, requires that biomass-derived CO2 be reported as additional information.  This is the approach generally prescribed for national inventories by the United Nations Framework Convention on Climate Change."]
[]
[null,"Any increases or decreases in the amount of carbon sequestered by the forests are accounted for in the comprehensive forest accounting system.  This is the approach generally prescribed for national inventories by the United Nations Framework Convention on Climate Change.  Most international protocols including that of the Intergovernmental Panel on Climate Change (IPCC) have adopted the convention set out by the United Nations. "]
[]
[null,"Estimated Biomass Emissions:\nThe information reported below on biomass emissions is being supplied:\n\n To ensure that readers understand the entity’s overall energy profile in terms of both greenhouse gas emissions, and non-greenhouse gas emissions, and\n To provide awareness and understanding of how biomass fuels are generated and used in the manufacture of wood products.\n\nAlso, note that the information reported below is in conformance with the general greenhouse gas protocol designed by the World Resources Institute and the World Business Council for Sustainable Development.  Users of these calculation tools may elect to modify the format and type of information presented based on specific facility or company needs.\n"]
[]
{"$rows_left_out":35}
{"sheet":"Indirect - Energy Imports","index":7,"n_rows":55,"n_cols":11,"rows_kept":55,"cut":false,"hidden":false,"merged":[[39,2,39,5],[30,2,30,6],[0,1,0,12],[6,3,6,4],[7,3,7,4],[5,3,5,4],[12,4,12,6],[12,7,12,9],[32,2,32,9]]}
[null,"These spreadsheets include significant amounts of material copied from other WRI and WBCSD calculation tools. \n Intellectual property rights of the WRI and WBCSD calculation tools belong to WRI and WBCSD, unless stated otherwise."]
[null,null,"Optional - Indirect Emissions"]
[null,null,"Electricity and/or steam imports"]
[]
[null,"EXPLANATION OF CELL COLOUR SCHEME"]
[null,null,null,"User entry: Source description"]
[null,null,null,"User entry: Fuel use / emission factor values"]
[null,null,null,"Auto calculated value:"]
[]
[]
{"$rows_left_out":46}
{"sheet":"Indirect - Energy Exports","index":8,"n_rows":35,"n_cols":14,"rows_kept":35,"cut":false,"hidden":false,"merged":[[34,3,34,7],[17,8,17,10],[0,1,0,12],[7,3,7,4],[8,3,8,4],[9,3,9,4],[17,4,17,6],[12,2,12,7]]}
[null,"These spreadsheets include significant amounts of material copied from other WRI and WBCSD calculation tools. \n Intellectual property rights of the WRI and WBCSD calculation tools belong to WRI and WBCSD, unless stated otherwise."]
[null,null,"Optional - Emissions Associated with Exports of Electricity and Steam"]
[]
[null,null,"Note: The emissions related to electricity and steam exports "]
[null,null,"should be reported separately from indirect emissions from imported power or steam"]
[]
[null,"EXPLANATION OF CELL COLOUR SCHEME"]
[null,null,null,"User entry: Source description"]
[null,null,null,"User entry: Fuel use / emission factor values"]
[null,null,null,"Auto calculated value:"]
{"$rows_left_out":26}
{"sheet":"CHP Allocation","index":9,"n_rows":34,"n_cols":19,"rows_kept":34,"cut":false,"hidden":false,"merged":[[18,7,18,8],[1,1,1,14],[10,3,10,4],[11,3,11,4],[33,1,33,9],[20,10,20,11],[3,3,3,11],[9,3,9,4],[14,2,14,8],[16,5,16,13],[18,10,18,11]]}
[]
[null,"These spreadsheets include significant amounts of material copied from other WRI and WBCSD calculation tools. \n Intellectual property rights of the WRI and WBCSD calculation tools belong to WRI and WBCSD, unless stated otherwise."]
[]
[null,null,null,"Combined heat and power:  \nAllocating emissions based on the efficiency of heat and power production"]
[]
[null,null,null,"Note:  If a facility is using all of the energy outputs of a CHP system, there is no need to allocate the emissions."]
[]
[null,null,"EXPLANATION OF CELL COLOR SCHEME"]
[null,null,null,null,"User entry: Source / fuel description"]
[null,null,null,"User entry: Fuel use / emission factor values"]
{"$rows_left_out":25}
{"sheet":"Summary Table","index":10,"n_rows":29,"n_cols":9,"rows_kept":29,"cut":false,"hidden":false,"merged":[[0,2,0,14],[4,2,4,3],[6,2,6,3],[9,2,9,3],[4,5,4,8],[6,5,6,8],[17,2,17,3],[3,3,3,7],[15,2,15,3],[23,2,23,3],[28,2,28,3],[19,2,19,3],[13,2,13,3],[27,2,27,3]]}
[null,null,"These spreadsheets include significant amounts of material copied from other WRI and WBCSD calculation tools. \n Intellectual property rights of the WRI and WBCSD calculation tools belong to WRI and WBCSD, unless stated otherwise."]
[null,null,"Summary of Inventory Results"]
[]
[null,null,null,{"$f":"IF(I20<10000,\"Did Not Exceed Threshold - Not Required To Report\",\"Threshold Exceeded - Required To Report\")","v":"Did Not Exceed Threshold - Not Required To Report"}]
[null,null,"Name of Inventory",null,null,{"$f":"IF('Operations in Inventory'!F8=\"\",\"\",'Operations in Inventory'!F8)","v":""}]
[]
[null,null,"General description of inventory boundaries",null,null,{"$f":"IF('Operations in Inventory'!F10=\"\",\"\",'Operations in Inventory'!F10)","v":""}]
[]
[null,null,"Required Information: Direct Emissions",null,null,"CO2\n(metric tonnes)","CH4\n(metric tonnes)","N2O\n(metric tonnes)","CO2-equiv\n(metric tonnes)"]
[null,null,"Stationary Fuel Combustion Emissions ",null,null,{"$f":"'Direct - Fuel Combust.'!J48","v":0},{"$f":"'Direct - Fuel Combust.'!K48","v":0},{"$f":"'Direct - Fuel Combust.'!L48","v":0},{"$f":"'Direct - Fuel Combust.'!M48","v":0}]
{"$rows_left_out":20}
{"sheet":"Custom Emission Factors","index":11,"n_rows":25,"n_cols":6,"rows_kept":25,"cut":false,"hidden":false,"merged":[[9,3,9,4],[7,3,7,4],[8,3,8,4]]}
["The intellectual property rights of this calculation tool belong to WRI and WBCSD, unless stated otherwise in any of the tools."]
["Please cite the orginial reference when using this tool."]
[]
[null,null,"Custom Emission Factors"]
[null,null,"Calculating custom emission factors"]
[]
[null,"EXPLANATION OF CELL COLOUR SCHEME"]
[null,null,null,"User entry: Source description"]
[null,null,null,"User entry: Fuel use / emission factor values"]
[null,null,null,"Auto calculated value:"]
{"$rows_left_out":16}
{"sheet":"Energy content","index":12,"n_rows":29,"n_cols":4,"rows_kept":29,"cut":false,"hidden":false,"merged":[[3,0,3,6],[28,1,28,3]]}
[]
["Energy content (HHV)"]
["Default factors for fuel specific higher heating values"]
["Copied from VCR (Canadian GHG Challenge Registry Guide to Entity & Facility-Based Reporting, Version 4.0, February 2005, Table 16, p. 34, unless specifically noted otherwise for specific entries)"]
[]
[]
[]
[null,"Fuel type","Higher heating value‡","Heating Value Units"]
[null,null,"(HHV)"]
[]
{"$rows_left_out":20}
{"sheet":"Conversion Factors","index":13,"n_rows":81,"n_cols":6,"rows_kept":81,"cut":false,"hidden":false,"merged":[[18,2,22,2],[27,2,31,2],[36,2,37,2],[38,2,39,2]]}
["The intellectual property rights of this calculation tool belong to WRI and WBCSD, unless stated otherwise in any of the tools."]
["Please cite the orginial reference when using this tool."]
[]
[]
["Unit Conversion Tables - copied from VCR ( Canadian GHG Challenge Registry Guide to Entity & Facility-Based Reporting, Version 4.0, February 2005, Table 13, 14, 15, and entries from Table 16, pp. 34-5)"]
[]
[]
[null,"Metric Prefixes"]
[null,null,"Abbreviation","Prefix","Multiple"]
[null,null,"k","kilo-","103"]
{"$rows_left_out":72}
{"sheet":"Raw Data Log","index":14,"n_rows":158,"n_cols":13,"rows_kept":158,"cut":false,"hidden":false,"merged":[]}
["Stationary Sources",null,null,null,"CO2",null,"CH4",null,"N20"]
["Source Description","Fuel Type","Quantity Burned","Units","Emission Factor","Units","Emission Factor","Units","Emission Factor","Units"]
[]
[]
[]
[]
[]
[]
[]
[]
{"$rows_left_out":149}
{"sheet":"Energy Factors","index":15,"n_rows":143,"n_cols":256,"rows_kept":143,"cut":false,"hidden":false,"merged":[[39,17,52,17]]}
["This table presents a matrix of factors for converting fuel consumption input data into units of GJ HHV",null,null,null,null,null,null,null,null,null,null,null,null,null,null,null,null,null,null,null,null,null,null,null,null,null,null,null,null,null,null,null,null,null,null,null,null,null,null,null,null,null,null,null,null,null,null,null,null,null,null,null,null,null,null,null,null,null,null,null,null,null,null,null,null,null,null,null,null,null,null,null,null,null,null,null,null,null,null,null,null,null,null,null,null,null,null,null,null,null,null,null,null,null,null,null,null,null,null,null,null,null,null,null,null,null,null,null,null,null,null,null,null,null,null,null,null,null,null,null,null,null,null,null,null,null,null,null,null,null,null,null,null,null,null,null,null,null,null,null,null,null,null,null,null,null,null,null,null,null,null,null,null,null,null,null,null,null,null,null,null,null,null,null,null,null,null,null,null,null,null,null,null,null,null,null,null,null,null,null,null,null,null,null,null,null,null,null,null,null,null,null,null,null,null,null,null,null,null,null,null,null,null,null,null,null,null,null,null,null,null,null,null,null,null,null,null,null,null,null,null,null,null,null,null,null,null,null,null,null,null,null,null,null,null,null,null,null,null,null,null,null,null,null,null,null,null,null,null,null,null,null,null,null,null,"Disable Error Notification Save Box"]
["(Fuel consumption data in units listed can be converted to units of GJ HHV by multiplying by the factor)",null,null,null,null,null,null,null,null,null,null,null,null,null,null,null,null,null,null,null,null,null,null,null,null,null,null,null,null,null,null,null,null,null,null,null,null,null,null,null,null,null,null,null,null,null,null,null,null,null,null,null,null,null,null,null,null,null,null,null,null,null,null,null,null,null,null,null,null,null,null,null,null,null,null,null,null,null,null,null,null,null,null,null,null,null,null,null,null,null,null,null,null,null,null,null,null,null,null,null,null,null,null,null,null,null,null,null,null,null,null,null,null,null,null,null,null,null,null,null,null,null,null,null,null,null,null,null,null,null,null,null,null,null,null,null,null,null,null,null,null,null,null,null,null,null,null,null,null,null,null,null,null,null,null,null,null,null,null,null,null,null,null,null,null,null,null,null,null,null,null,null,null,null,null,null,null,null,null,null,null,null,null,null,null,null,null,null,null,null,null,null,null,null,null,null,null,null,null,null,null,null,null,null,null,null,null,null,null,null,null,null,null,null,null,null,null,null,null,null,null,null,null,null,null,null,null,null,null,null,null,null,null,null,null,null,null,null,null,null,null,null,null,null,null,null,null,null,null,null,null,null,null,null,1]
[]
["Consumption Input Units (right)","Btu (HHV)","Btu (LHV)","Million Btu (HHV)","Million Btu (LHV)","GJ (HHV)","US gallon","Litre","bbl","std ft3","std m3","lb","US ton","kg","Metric Tonne","GJ (LHV)","MWh"]
["Fuel type (below)"]
["Car (Gasoline)",1.0550559865459259E-6,1.1109739538328601E-6,1.0550559865459261,1.11097395383286,1,0.13118849356548068,3.4659999999999996E-2,5.5099167297501888,0.98145264052102499,34.659999999999997,"N/A","N/A","N/A","N/A",1.0527348633755249,3.6]
["Light truck (Gasoline)",1.0550559865459259E-6,1.1109739538328601E-6,1.0550559865459261,1.11097395383286,1,0.13118849356548068,3.4659999999999996E-2,5.5099167297501888,0.98145264052102499,34.659999999999997,"N/A","N/A","N/A","N/A",1.0527348633755249,3.6]
["Heavy Duty Vehicle (Gasoline)",1.0550559865459259E-6,1.1109739538328601E-6,1.0550559865459261,1.11097395383286,1,0.13118849356548068,3.4659999999999996E-2,5.5099167297501888,0.98145264052102499,34.659999999999997,"N/A","N/A","N/A","N/A",1.0527348633755249,3.6]
["Motorcycle (Gasoline)",1.0550559865459259E-6,1.1109739538328601E-6,1.0550559865459261,1.11097395383286,1,0.13118849356548068,3.4659999999999996E-2,5.5099167297501888,0.98145264052102499,34.659999999999997,"N/A","N/A","N/A","N/A",1.0527348633755249,3.6]
["Off-Road Vehicles (Gasoline)",1.0550559865459259E-6,1.1109739538328601E-6,1.0550559865459261,1.11097395383286,1,0.13118849356548068,3.4659999999999996E-2,5.5099167297501888,0.98145264052102499,34.659999999999997,"N/A","N/A","N/A","N/A",1.0527348633755249,3.6]
{"$rows_left_out":134}
{"sheet":"Revisions","index":16,"n_rows":4,"n_cols":4,"rows_kept":4,"cut":false,"hidden":false,"merged":[]}
["Version","Changes","Implementor","Date"]
["3.3b","Updated 100 year global warming potentials to IPCC AR4 and modified spreadsheet to enable easily changed GWPs.","BJM","2022-02-10"]
[null,"Created Revision tab","BJM","2022-03-01"]
[null,"Updated Method 3 on Waste Management tab to better reflect IPCC methodology","BJM","2022-03-01"]